[makepkg] Erreur d'encodage

Mise à jour / Création /debug de paquetages
pepit
Daikyu
Messages : 63
Inscription : dim. 02 mars 2014, 15:53
Localisation : Proche Lyon

[makepkg] Erreur d'encodage

Message par pepit »

Bonjour, tantant d'installer un PKGBUILD d'aur : "network-ups-tools", j'obtient l'erreur suivante lorsque je lance makepkg -s:

Code : Tout sélectionner

Traceback (most recent call last):
  File "/usr/bin/a2x", line 960, in <module>
    a2x.execute()
  File "/usr/bin/a2x", line 378, in execute
    self.__getattribute__('to_'+self.format)()
  File "/usr/bin/a2x", line 658, in to_xhtml
    self.copy_resources(xhtml_file, src_dir, self.destination_dir)
  File "/usr/bin/a2x", line 608, in copy_resources
    src = os.path.join(src_dir, src)
  File "/usr/lib/python2.7/posixpath.py", line 73, in join
    path += '/' + b
UnicodeDecodeError: 'ascii' codec can't decode byte 0xc3 in position 22: ordinal not in range(128)
Makefile:797 : la recette pour la cible « developer-guide.html » a échouée
make[1]: *** [developer-guide.html] Erreur 1
make[1] : on quitte le répertoire « /mnt/MAISON/home/pep/Téléchargement/Archives/aur/network-ups-tools/src/nut-2.7.3/docs »
Makefile:513 : la recette pour la cible « all-recursive » a échouée
make: *** [all-recursive] Erreur 1
==> ERREUR : Une erreur s’est produite dans build().
    Abandon...
Bien que cette erreur semble fréquente je ne comprend pas la démarche pour la résoudre, si quelqu'un à une solution à ma portée... :roll:
Un Dell D630 et un Xeon E51620 V3 monté sur Gigabyte X99-UD4 8Gio DDR4 en 2 barettes. Affichage en cours d'évolution:1 NV GT720. DD système: 1 SSD 250 gio DD données: 4 sas 140 gio en raid 5 (2 VD: ntfs et ext4)
olive
newbie
Messages : 1
Inscription : mar. 27 oct. 2015, 19:15

Re: [makepkg] Erreur d'encodage

Message par olive »

Bizarre, moi je n'ai pas cette erreur. Essaye peut-être de désactiver la localisation:

Code : Tout sélectionner

export LC_ALL=C
export LANG=C
makepkg
pepit
Daikyu
Messages : 63
Inscription : dim. 02 mars 2014, 15:53
Localisation : Proche Lyon

Re: [makepkg] Erreur d'encodage

Message par pepit »

J'ai essayé: Même résultat! :shock:
Un Dell D630 et un Xeon E51620 V3 monté sur Gigabyte X99-UD4 8Gio DDR4 en 2 barettes. Affichage en cours d'évolution:1 NV GT720. DD système: 1 SSD 250 gio DD données: 4 sas 140 gio en raid 5 (2 VD: ntfs et ext4)
Fanch
archer
Messages : 140
Inscription : lun. 01 déc. 2008, 21:16
Contact :

Re: [makepkg] Erreur d'encodage

Message par Fanch »

essaye en mettant LANG=C au début de la section build() { du fichier PKGBUILD
"The three principal virtues of a programmer are Laziness, Impatience, and Hubris." -> man perl
pepit
Daikyu
Messages : 63
Inscription : dim. 02 mars 2014, 15:53
Localisation : Proche Lyon

Re: [makepkg] Erreur d'encodage(résolut)

Message par pepit »

Bingo, ça a marché Fanch, merci. Il me faut encore configurer le programme en désignant le pilote, mais c'est en bonne voie!
Un Dell D630 et un Xeon E51620 V3 monté sur Gigabyte X99-UD4 8Gio DDR4 en 2 barettes. Affichage en cours d'évolution:1 NV GT720. DD système: 1 SSD 250 gio DD données: 4 sas 140 gio en raid 5 (2 VD: ntfs et ext4)
Répondre