[Driver] Impossible d'installer mon driver wifi ADWF300

Applications, problèmes de configuration réseau
Kaome
newbie
Messages : 1
Inscription : mer. 16 janv. 2019, 20:14

[Driver] Impossible d'installer mon driver wifi ADWF300

Message par Kaome » mer. 16 janv. 2019, 20:18

Bonjour/bonsoir,

Je suis passé sous Arch Linux récemment mais je rencontre un problème quand j'essaye d'installer mon driver wifi , voici le message d'Erreur :

make ARCH=x86_64 CROSS_COMPILE= -C /lib/modules/4.20.1-arch1-1-ARCH/build M=/home/k/Downloads/ADW/Driver/linux/driver/rtl8192EU_linux_v4.2.2_7585.20130524 modules
make[1]: Entering directory '/usr/lib/modules/4.20.1-arch1-1-ARCH/build'
CC [M] /home/k/Downloads/ADW/Driver/linux/driver/rtl8192EU_linux_v4.2.2_7585.20130524/core/rtw_cmd.o
In file included from /home/k/Downloads/ADW/Driver/linux/driver/rtl8192EU_linux_v4.2.2_7585.20130524/include/osdep_service.h:41,
from /home/k/Downloads/ADW/Driver/linux/driver/rtl8192EU_linux_v4.2.2_7585.20130524/include/drv_types.h:32,
from /home/k/Downloads/ADW/Driver/linux/driver/rtl8192EU_linux_v4.2.2_7585.20130524/core/rtw_cmd.c:22:
/home/k/Downloads/ADW/Driver/linux/driver/rtl8192EU_linux_v4.2.2_7585.20130524/include/osdep_service_linux.h: In function ‘_init_timer’:
/home/k/Downloads/ADW/Driver/linux/driver/rtl8192EU_linux_v4.2.2_7585.20130524/include/osdep_service_linux.h:254:8: error: ‘_timer’ {aka ‘struct timer_list’} has no member named ‘data’
ptimer->data = (unsigned long)cntx;
^~
/home/k/Downloads/ADW/Driver/linux/driver/rtl8192EU_linux_v4.2.2_7585.20130524/include/osdep_service_linux.h:255:2: error: implicit declaration of function ‘init_timer’; did you mean ‘_init_timer’? [-Werror=implicit-function-declaration]
init_timer(ptimer);
^~~~~~~~~~
_init_timer
cc1: some warnings being treated as errors
make[2]: *** [scripts/Makefile.build:292: /home/k/Downloads/ADW/Driver/linux/driver/rtl8192EU_linux_v4.2.2_7585.20130524/core/rtw_cmd.o] Error 1
make[1]: *** [Makefile:1563: _module_/home/k/Downloads/ADW/Driver/linux/driver/rtl8192EU_linux_v4.2.2_7585.20130524] Error 2
make[1]: Leaving directory '/usr/lib/modules/4.20.1-arch1-1-ARCH/build'
make: *** [Makefile:1043: modules] Error 2
##################################################
Compile make driver error: 2
Please check error Mesg
##################################################

Merci d'avance :)

Avatar de l’utilisateur
Joffrey
Daikyu
Messages : 84
Inscription : mar. 08 sept. 2015, 23:42

Re: [Driver] Impossible d'installer mon driver wifi ADWF300

Message par Joffrey » jeu. 17 janv. 2019, 06:43

Bonjour,

Il faut que tu donnes les sources. La recette ne vient pas d'AUR on dirait.

Avatar de l’utilisateur
FoolEcho
Maître du Kyudo
Messages : 10532
Inscription : dim. 15 août 2010, 11:48
Localisation : Basse-Normandie

Re: [Driver] Impossible d'installer mon driver wifi ADWF300

Message par FoolEcho » jeu. 17 janv. 2019, 09:19

Kaome a écrit :
mer. 16 janv. 2019, 20:18

Je suis passé sous Arch Linux récemment mais je rencontre un problème quand j'essaye d'installer mon driver wifi , voici le message d'Erreur :

make ARCH=x86_64 CROSS_COMPILE= -C /lib/modules/4.20.1-arch1-1-ARCH/build M=/home/k/Downloads/ADW/Driver/linux/driver/rtl8192EU_linux_v4.2.2_7585.20130524 modules
make[1]: Entering directory '/usr/lib/modules/4.20.1-arch1-1-ARCH/build'
CC [M] /home/k/Downloads/ADW/Driver/linux/driver/rtl8192EU_linux_v4.2.2_7585.20130524/core/rtw_cmd.o
A priori il existe des recettes sur AUR: rtl8192eu.
«The following statement is not true. The previous statement is true.» :nage:

Répondre